Repository Issue Activity (beta)

kelvinben/appinfoscanner

Current issue state, recent activity, and per-issue timelines from the indexed issue data.

Open Issues
0
New in 7 Days
0
Closed in 7 Days
23
Average Open Age
N/A
Stale 30+ Days
0
Stale 90+ Days
0
Last 2 Weeks
DateOpenedClosedCommentsEventsOpen Backlog
2026-09-2100000
2026-09-2002323460
2026-09-1900000
2026-09-1800000
2026-09-1700000
2026-09-1600000
2026-09-1500000
2026-09-1400000
2026-09-1300000
2026-09-1200000
2026-09-1100000
2026-09-1000000
2026-09-0900000
2026-09-0800000
This Week

Opened: 0

Closed: 23

Comments: 23

Events: 46

Top Labels

No label distribution is available yet.

Issue Explorer
IssueAuthorStateLabelsCommentsReactionsUpdated

#42 脱壳之后dex的输出结果为空

Opened 3 years ago
yxiatian
closed - completed
No labels
1011 hours ago

#41 反编译失败

Opened 3 years ago
evaderPluto
closed - completed
No labels
2011 hours ago

#39 Could not decode arsc file. Decompilation failed.

Opened 3 years ago
ThanatosXingYu
closed - completed
No labels
1011 hours ago

#38 Decompilation failed, please submit error information at

Opened 3 years ago
qySec
closed - completed
No labels
2011 hours ago

#37 [-] Decompilation failed, please submit error information at https://github.com/kelvinBen/AppInfoScanner/issues

Opened 3 years ago
zb123cdfg
closed - completed
No labels
1011 hours ago

#36 adb: error: failed to get feature set: no devices/emulators found

Opened 3 years ago
dkive
closed - completed
No labels
2011 hours ago

#35 [-] Decompilation failed, please submit error information at https://github.com/kelvinBen/AppInfoScanner/issues

Opened 3 years ago
Admin-Tom
closed - completed
No labels
1011 hours ago

#34 安装requirements.txt错误

Opened 3 years ago
Dr3Wm
closed - completed
No labels
2011 hours ago

#33 Exception: Please install the Java environment!

Opened 4 years ago
R00T-1024
closed - completed
No labels
8011 hours ago

#27 卡在Searching for strings that match the rules 不动了

Opened 4 years ago
cnwpdb
closed - completed
No labels
2011 hours ago

#26 执行报错

Opened 4 years ago
yannhank
closed - completed
No labels
2011 hours ago

#23 Decompilation failed

Opened 4 years ago
Rand0mPythoner
closed - completed
No labels
1011 hours ago

#22 Exception in thread "main" brut.androlib.err.RawXmlEncounteredException: Could not decode XML

Opened 4 years ago
antique-goo
closed - completed
No labels
2011 hours ago

#15 AttributeError: 'WrappedSocket' object has no attribute 'getpeername'

Opened 4 years ago
N0o01
closed - completed
No labels
2011 hours ago

#14 Decompilation failed, please submit error information at

Opened 5 years ago
BypassKing
closed - completed
No labels
3011 hours ago

#12 报错页面

Opened 5 years ago
xxsmile123
closed - completed
No labels
1011 hours ago

#43 执行apt分析,显示Running failed, please check the error in terminal

Opened 3 years ago
yaohao803
closed - completed
No labels
1011 hours ago

#45 找不到AdbWinApi.dll

Opened 3 years ago
zhangjianqun-heyin
closed - completed
No labels
3011 hours ago

#46 无法正常运行解析

Opened 2 years ago
JeffSnown
closed - completed
No labels
1011 hours ago

#47 用pip install frida-tools命令安装frida-tools报错

Opened 2 years ago
hejila
closed - completed
No labels
2011 hours ago

#48 we can't install the APP

Opened 2 years ago
Zyi06
closed - completed
No labels
1011 hours ago

#50 反编译错误/失败

Opened 2 years ago
pushideren
closed - completed
No labels
1011 hours ago

#52 Decompilation failed

Opened 11 months ago
PengeYuan
closed - completed
No labels
1011 hours ago

#20 系统增加自定义jdk的配置项或参数

Opened 4 years ago
kenyon-wong
closed - completed
No labels
305 months ago

Rows per page:

1–24 of 24